Saturday, September 24, 2022
HomeiOS Developmentflutter - flutter_inappwebview with iOS 16

flutter – flutter_inappwebview with iOS 16


Launching lib/primary.dart on iPhone 14 Professional Max in debug mode…
Operating pod set up…
Operating Xcode construct…
Xcode construct performed. 13,0s
Didn’t construct iOS app
Error output from Xcode construct:

** BUILD FAILED **

Xcode’s output:

Writing end result bundle at path:
/var/folders/1w/tncq7cqs7wdblnbp_f35d_s00000gp/T/flutter_tools.SQyxcZ/flutter_ios_build_temp_dirC9UeU4/temporary_xcresult_bundle

/Customers/usuario/.pub-cache/hosted/pub.dartlang.org/flutter_inappwebview-5.4.3+7/ios/Lessons/Varieties/UserScript.swift:13:6: error: saved properties can't be marked doubtlessly unavailable with '@accessible'
    @accessible(iOS 14.0, *)
     ^
error: the next command failed with exit code 1 however produced no additional output
CompileSwift regular x86_64 /Customers/usuario/.pub-cache/hosted/pub.dartlang.org/flutter_inappwebview-5.4.3+7/ios/Lessons/Varieties/UserScript.swift (in goal 'flutter_inappwebview' from mission 'Pods')
/Customers/usuario/.pub-cache/hosted/pub.dartlang.org/flutter_inappwebview-5.4.3+7/ios/Lessons/Varieties/UserScript.swift:13:6: error: saved properties can't be marked doubtlessly unavailable with '@accessible'
    @accessible(iOS 14.0, *)
     ^
notice: Constructing targets in dependency order
warning: Run script construct section 'Run Script' can be run throughout each construct as a result of it doesn't specify any outputs. To deal with this warning, both add output dependencies to the script section, or configure it to run in each construct by unchecking "Primarily based on dependency evaluation" within the script section. (in goal 'Runner' from mission 'Runner')
warning: Run script construct section 'Skinny Binary' can be run throughout each construct as a result of it doesn't specify any outputs. To deal with this warning, both add output dependencies to the script section, or configure it to run in each construct by unchecking "Primarily based on dependency evaluation" within the script section. (in goal 'Runner' from mission 'Runner')

End result bundle written to path:
    /var/folders/1w/tncq7cqs7wdblnbp_f35d_s00000gp/T/flutter_tools.SQyxcZ/flutter_ios_build_temp_dirC9UeU4/temporary_xcresult_bundle

Swift Compiler Error (Xcode): Saved properties can’t be marked doubtlessly unavailable with ‘@accessible’
/Customers/usuario/.pub-cache/hosted/pub.dartlang.org/flutter_inappwebview-5.4.3+7/ios/Lessons/Varieties/UserScript.swift:12:5

Model: flutter_inappwebview: ^5.4.3+7

RELATED ARTICLES

LEAVE A REPLY

Please enter your comment!
Please enter your name here

Most Popular

Recent Comments